{"text_format":"1","workbook":"xlsx","n_sheets":3,"sheets":["Discover","Read_Temp","Configuration"],"not_rendered":{"charts":1,"images":0,"macros":1,"external_links":0,"defined_names":0,"comments":0,"pivot_tables":0},"unopened":[],"bounds":{"document_bytes":16777216,"sheet_cells":100000,"rows_first":2000,"rows_last":500,"rows_between":2000,"halvings":0,"cell_chars":16384,"cell_head_chars":4096},"cells_cut":0,"cells_raw":0,"read":"whole","date_system":"1900"}

{"sheet":"Discover","index":0,"n_rows":57,"n_cols":14,"rows_kept":57,"cut":false,"hidden":false,"merged":[]}
[]
[]
[null,null,null,null,"Network adapter :"]
[null,null,null,null,"Name","IP address","subnet mask","broadcast IP"]
[null,null,null,null,"Realtek PCIe GbE Family Controller","10.10.48.34","255.255.252.0","10.10.51.255"]
[]
[]
[]
[]
[]
[]
[]
[]
[]
[]
[]
[]
[null,null,null,null,"TCP/IP devices :"]
[null,null,null,null,"IP address","MAC address","Ipmode","static IP","subnet mask","Port config","Port command","Port Modbus","Connected","Connect IP"]
[]
[]
[]
[]
[]
[]
[]
[]
[]
[]
[]
[]
[]
[]
[]
[]
[]
[]
[]
[]
[]
[]
[]
[]
[]
[]
[]
[]
[]
[]
[]
[]
[]
[]
[]
[]
[]
[5,29,30.9]

{"sheet":"Read_Temp","index":1,"n_rows":109,"n_cols":26,"rows_kept":109,"cut":false,"hidden":false,"merged":[]}
[null,null,null,null,null,null,null,null,null,null,null,null,null,null,null,null,null,null,null,null,null,null,null,null,null,"Spalte1"]
[null,"IP-Adresse",null,0,null,null,null,null,null,null,null,null,null,null,null,null,null,null,null,null,null,null,null,null,null,{"$f":"IF(Discover!E20 <> \"\",Discover!E20,\"\")","v":""}]
[null,"Port",55002,null,null,null,null,null,null,null,null,null,null,null,null,null,null,null,null,null,null,null,null,null,null,{"$f":"IF(Discover!E21 <> \"\",Discover!E21,\"\")","v":""}]
[null,"Number \nof values",100,null,null,null,null,null,null,null,null,null,null,null,null,null,null,null,null,null,null,null,null,null,null,{"$f":"IF(Discover!E22 <> \"\",Discover!E22,\"\")","v":""}]
[null,null,null,null,null,null,null,null,null,null,null,null,null,null,null,null,null,null,null,null,null,null,null,null,null,{"$f":"IF(Discover!E23 <> \"\",Discover!E23,\"\")","v":""}]
[null,null,null,null,null,null,null,null,null,null,null,null,null,null,null,null,null,null,null,null,null,null,null,null,null,{"$f":"IF(Discover!E24 <> \"\",Discover!E24,\"\")","v":""}]
[null,null,null,null,null,null,null,null,null,null,null,null,null,null,null,null,null,null,null,null,null,null,null,null,null,{"$f":"IF(Discover!E25 <> \"\",Discover!E25,\"\")","v":""}]
[null,"Socket ID",5148,null,null,null,null,null,null,null,null,null,null,null,null,null,null,null,null,null,null,null,null,null,null,{"$f":"IF(Discover!E26 <> \"\",Discover!E26,\"\")","v":""}]
[null,null,null,null,null,null,null,null,null,null,null,null,null,null,null,null,null,null,null,null,null,null,null,null,null,{"$f":"IF(Discover!E27 <> \"\",Discover!E27,\"\")","v":""}]
[8,200,124.8,null,null,null,null,null,null,null,null,null,null,null,null,null,null,null,null,null,null,null,null,null,null,{"$f":"IF(Discover!E28 <> \"\",Discover!E28,\"\")","v":""}]
[8,201,124.9,null,null,null,null,null,null,null,null,null,null,null,null,null,null,null,null,null,null,null,null,null,null,{"$f":"IF(Discover!E29 <> \"\",Discover!E29,\"\")","v":""}]
[8,201,124.9,null,null,null,null,null,null,null,null,null,null,null,null,null,null,null,null,null,null,null,null,null,null,{"$f":"IF(Discover!E30 <> \"\",Discover!E30,\"\")","v":""}]
[8,200,124.8,null,null,null,null,null,null,null,null,null,null,null,null,null,null,null,null,null,null,null,null,null,null,{"$f":"IF(Discover!E31 <> \"\",Discover!E31,\"\")","v":""}]
[8,200,124.8,null,null,null,null,null,null,null,null,null,null,null,null,null,null,null,null,null,null,null,null,null,null,{"$f":"IF(Discover!E32 <> \"\",Discover!E32,\"\")","v":""}]
[8,200,124.8,null,null,null,null,null,null,null,null,null,null,null,null,null,null,null,null,null,null,null,null,null,null,{"$f":"IF(Discover!E33 <> \"\",Discover!E33,\"\")","v":""}]
[8,201,124.9]
[8,200,124.8]
[8,201,124.9]
[8,200,124.8]
[8,200,124.8]
[8,200,124.8]
[8,201,124.9]
[8,200,124.8]
[8,200,124.8]
[8,201,124.9]
[8,201,124.9]
[8,201,124.9]
[8,201,124.9]
[8,201,124.9]
[8,200,124.8]
[8,201,124.9]
[8,201,124.9]
[8,200,124.8]
[8,201,124.9]
[8,200,124.8]
[8,201,124.9]
[8,201,124.9]
[8,201,124.9]
[8,201,124.9]
[8,201,124.9]
[8,201,124.9]
[8,201,124.9]
[8,201,124.9]
[8,200,124.8]
[8,201,124.9]
[8,200,124.8]
[8,200,124.8]
[8,200,124.8]
[8,200,124.8]
[8,201,124.9]
[8,201,124.9]
[8,201,124.9]
[8,201,124.9]
[8,201,124.9]
[8,200,124.8]
[8,200,124.8]
[8,201,124.9]
[8,201,124.9]
[8,201,124.9]
[8,200,124.8]
[8,200,124.8]
[8,201,124.9]
[8,201,124.9]
[8,200,124.8]
[8,200,124.8]
[8,200,124.8]
[8,200,124.8]
[8,201,124.9]
[8,201,124.9]
[8,201,124.9]
[8,201,124.9]
[8,201,124.9]
[8,200,124.8]
[8,201,124.9]
[8,200,124.8]
[8,201,124.9]
[8,200,124.8]
[8,201,124.9]
[8,201,124.9]
[8,201,124.9]
[8,201,124.9]
[8,201,124.9]
[8,200,124.8]
[8,201,124.9]
[8,200,124.8]
[8,200,124.8]
[8,200,124.8]
[8,200,124.8]
[8,200,124.8]
[8,201,124.9]
[8,201,124.9]
[8,201,124.9]
[8,201,124.9]
[8,201,124.9]
[8,201,124.9]
[8,200,124.8]
[8,201,124.9]
[8,200,124.8]
[8,201,124.9]
[8,201,124.9]
[8,200,124.8]
[8,200,124.8]
[8,201,124.9]
[8,201,124.9]
[8,201,124.9]
[8,200,124.8]
[8,200,124.8]
[8,200,124.8]
[8,201,124.9]

{"sheet":"Configuration","index":2,"n_rows":48,"n_cols":10,"rows_kept":48,"cut":false,"hidden":false,"merged":[]}
[null,null,null,null,null,"MAC address"]
[null,"IP-Adresse",null,null,null,"IP-mode",null,null,"STATIC","DHCP"]
[null,"Port",55001,null,null,"static IP address"]
[null,null,null,null,null,"netmask"]
[null,null,null,null,null,"port command"]
[null,null,null,null,null,"port Modbus"]
[null,null,null,null,null,"port config"]
[]
[]
[]
[]
[]
[]
[]
[]
[]
[]
[]
[]
[]
[]
[]
[]
[]
[]
[]
[]
[]
[]
[]
[]
[]
[]
[]
[]
[]
[]
[]
[]
[]
[]
[]
[]
[]
[]
[]
[]
[4,178,20.2]